{"text_format":"1","workbook":"xlsx","n_sheets":8,"sheets":["1_申請書","2_施設一覧","3_平面図一覧","4_部屋一覧","5_機器一覧","6_領収証等一覧","7_台紙","リスト"],"not_rendered":{"charts":0,"images":0,"macros":1,"external_links":0,"defined_names":12,"comments":1,"pivot_tables":0},"unopened":[],"bounds":{"document_bytes":16777216,"sheet_cells":100000,"rows_first":2000,"rows_last":500,"rows_between":2000,"halvings":0,"cell_chars":16384,"cell_head_chars":4096},"cells_cut":0,"cells_raw":0,"read":"whole","date_system":"1900"}

{"sheet":"1_申請書","index":0,"n_rows":31,"n_cols":41,"rows_kept":31,"cut":false,"hidden":false,"merged":[[2,0,2,38],[4,29,4,30],[4,32,4,33],[4,35,4,36],[5,0,5,6],[5,10,5,13],[5,14,5,19],[9,0,16,0],[9,1,9,10],[9,11,9,38],[10,1,10,10],[10,11,10,38],[11,1,12,10],[11,16,11,17],[11,19,11,21],[12,11,12,38],[13,1,14,10],[13,11,13,17],[13,18,13,24],[13,25,13,31],[13,32,13,38],[14,11,14,17],[14,18,14,38],[23,0,23,38],[25,0,25,38],[18,11,18,38],[19,11,19,38],[26,0,26,5],[26,6,26,11],[26,12,26,13],[26,14,26,20],[26,21,26,38],[24,0,24,38],[21,0,21,38],[22,2,22,38],[22,0,22,1],[18,0,18,10],[19,0,19,10],[27,20,28,20],[27,21,27,38],[28,0,28,1],[28,6,28,8],[28,21,28,38],[27,15,28,15],[27,16,28,16],[27,17,28,17],[27,18,28,18],[27,19,28,19],[27,0,27,3],[27,4,27,5],[27,6,27,11],[27,12,28,13],[27,14,28,14],[29,0,29,6],[29,7,29,12],[29,13,29,20],[29,21,29,38],[30,0,31,6],[30,7,31,7],[30,8,31,8],[30,9,31,9],[30,10,31,10],[30,11,31,11],[30,12,31,12],[30,13,31,13],[30,14,31,14],[30,15,31,15],[30,16,31,16],[30,17,31,17],[32,0,32,38],[30,18,31,18],[30,19,31,19],[30,20,31,20],[30,21,30,38],[31,21,31,38],[11,23,11,38],[17,0,17,38],[20,0,20,38],[0,0,1,38],[3,0,3,38],[4,0,4,24],[15,1,15,10],[15,11,15,17],[15,18,15,24],[15,25,15,31],[15,32,15,38],[16,1,16,10],[16,11,16,17],[16,18,16,24],[16,25,16,31],[16,32,16,38]]}
[]
[]
["山梨県社会福祉施設等エアロゾル感染対策強化事業費補助金申請書"]
[]
[null,null,null,null,null,null,null,null,null,null,null,null,null,null,null,null,null,null,null,null,null,null,null,null,null,null,null,null,"　　令和",null,null,"年",null,null,"月",null,null,"日"]
["山梨県知事",null,null,null,null,null,null,null,"殿",null,"（提出先）"]
[]
["　標記について、次のとおり申請します。"]
[]
["申請者","フリガナ"]
{"$rows_left_out":22}
{"sheet":"2_施設一覧","index":1,"n_rows":73,"n_cols":9,"rows_kept":73,"cut":false,"hidden":false,"merged":[]}
["（様式２）施設一覧"]
[]
["施設№","事業所番号","施設名","サービス種別など","郵便番号","所在地","申請額合計"]
[1,null,null,null,null,null,{"$f":"IF(SUMIF('3_平面図一覧'!$A$4:$A$116,A4,'3_平面図一覧'!$E$4:$E$116)<>0,SUMIF('3_平面図一覧'!$A$4:$A$116,A4,'3_平面図一覧'!$E$4:$E$116),\"\")","v":""},null,{"$f":"OR(B4<>\"\",C4<>\"\",D4<>\"\",E4<>\"\",F4<>\"\",G4<>\"\")","v":false}]
[2,null,null,null,null,null,{"$f":"IF(SUMIF('3_平面図一覧'!$A$4:$A$116,A5,'3_平面図一覧'!$E$4:$E$116)<>0,SUMIF('3_平面図一覧'!$A$4:$A$116,A5,'3_平面図一覧'!$E$4:$E$116),\"\")","v":""},null,{"$f":"OR(B5<>\"\",C5<>\"\",D5<>\"\",E5<>\"\",F5<>\"\",G5<>\"\")","v":false}]
[3,null,null,null,null,null,{"$f":"IF(SUMIF('3_平面図一覧'!$A$4:$A$116,A6,'3_平面図一覧'!$E$4:$E$116)<>0,SUMIF('3_平面図一覧'!$A$4:$A$116,A6,'3_平面図一覧'!$E$4:$E$116),\"\")","v":""},null,false]
[4,null,null,null,null,null,{"$f":"IF(SUMIF('3_平面図一覧'!$A$4:$A$116,A7,'3_平面図一覧'!$E$4:$E$116)<>0,SUMIF('3_平面図一覧'!$A$4:$A$116,A7,'3_平面図一覧'!$E$4:$E$116),\"\")","v":""},null,false]
[5,null,null,null,null,null,{"$f":"IF(SUMIF('3_平面図一覧'!$A$4:$A$116,A8,'3_平面図一覧'!$E$4:$E$116)<>0,SUMIF('3_平面図一覧'!$A$4:$A$116,A8,'3_平面図一覧'!$E$4:$E$116),\"\")","v":""},null,false]
[6,null,null,null,null,null,{"$f":"IF(SUMIF('3_平面図一覧'!$A$4:$A$116,A9,'3_平面図一覧'!$E$4:$E$116)<>0,SUMIF('3_平面図一覧'!$A$4:$A$116,A9,'3_平面図一覧'!$E$4:$E$116),\"\")","v":""},null,false]
[7,null,null,null,null,null,{"$f":"IF(SUMIF('3_平面図一覧'!$A$4:$A$116,A10,'3_平面図一覧'!$E$4:$E$116)<>0,SUMIF('3_平面図一覧'!$A$4:$A$116,A10,'3_平面図一覧'!$E$4:$E$116),\"\")","v":""},null,false]
{"$rows_left_out":64}
{"sheet":"3_平面図一覧","index":2,"n_rows":116,"n_cols":8,"rows_kept":116,"cut":false,"hidden":false,"merged":[]}
["（様式３）平面図一覧"]
[]
["施設№","施設名","平面図№","階など","申請額合計"]
[null,{"$f":"IF(A4<>\"\",IF(VLOOKUP(A4,'2_施設一覧'!$A$4:$D$73,3,FALSE)=0,\"\",VLOOKUP(A4,'2_施設一覧'!$A$4:$D$73,3,FALSE)),\"\")","v":""},null,null,{"$f":"IF(SUMIF('4_部屋一覧'!$C$4:$C$79,C4,'4_部屋一覧'!$K$4:$K$79)<>0,SUMIF('4_部屋一覧'!$C$4:$C$79,C4,'4_部屋一覧'!$K$4:$K$79),\"\")","v":""},null,{"$f":"A4","v":0},{"$f":"OR(A4<>\"\",B4<>\"\",C4<>\"\",D4<>\"\",E4<>\"\")","v":false}]
[null,{"$f":"IF(A5<>\"\",IF(VLOOKUP(A5,'2_施設一覧'!$A$4:$D$73,3,FALSE)=0,\"\",VLOOKUP(A5,'2_施設一覧'!$A$4:$D$73,3,FALSE)),\"\")","v":""},null,null,{"$f":"IF(SUMIF('4_部屋一覧'!$C$4:$C$79,C5,'4_部屋一覧'!$K$4:$K$79)<>0,SUMIF('4_部屋一覧'!$C$4:$C$79,C5,'4_部屋一覧'!$K$4:$K$79),\"\")","v":""},null,{"$f":"A5","v":0},{"$f":"OR(A5<>\"\",B5<>\"\",C5<>\"\",D5<>\"\",E5<>\"\")","v":false}]
[null,{"$f":"IF(A6<>\"\",IF(VLOOKUP(A6,'2_施設一覧'!$A$4:$D$73,3,FALSE)=0,\"\",VLOOKUP(A6,'2_施設一覧'!$A$4:$D$73,3,FALSE)),\"\")","v":""},null,null,{"$f":"IF(SUMIF('4_部屋一覧'!$C$4:$C$79,C6,'4_部屋一覧'!$K$4:$K$79)<>0,SUMIF('4_部屋一覧'!$C$4:$C$79,C6,'4_部屋一覧'!$K$4:$K$79),\"\")","v":""},null,0,false]
[null,{"$f":"IF(A7<>\"\",IF(VLOOKUP(A7,'2_施設一覧'!$A$4:$D$73,3,FALSE)=0,\"\",VLOOKUP(A7,'2_施設一覧'!$A$4:$D$73,3,FALSE)),\"\")","v":""},null,null,{"$f":"IF(SUMIF('4_部屋一覧'!$C$4:$C$79,C7,'4_部屋一覧'!$K$4:$K$79)<>0,SUMIF('4_部屋一覧'!$C$4:$C$79,C7,'4_部屋一覧'!$K$4:$K$79),\"\")","v":""},null,0,false]
[null,{"$f":"IF(A8<>\"\",IF(VLOOKUP(A8,'2_施設一覧'!$A$4:$D$73,3,FALSE)=0,\"\",VLOOKUP(A8,'2_施設一覧'!$A$4:$D$73,3,FALSE)),\"\")","v":""},null,null,{"$f":"IF(SUMIF('4_部屋一覧'!$C$4:$C$79,C8,'4_部屋一覧'!$K$4:$K$79)<>0,SUMIF('4_部屋一覧'!$C$4:$C$79,C8,'4_部屋一覧'!$K$4:$K$79),\"\")","v":""},null,0,false]
[null,{"$f":"IF(A9<>\"\",IF(VLOOKUP(A9,'2_施設一覧'!$A$4:$D$73,3,FALSE)=0,\"\",VLOOKUP(A9,'2_施設一覧'!$A$4:$D$73,3,FALSE)),\"\")","v":""},null,null,{"$f":"IF(SUMIF('4_部屋一覧'!$C$4:$C$79,C9,'4_部屋一覧'!$K$4:$K$79)<>0,SUMIF('4_部屋一覧'!$C$4:$C$79,C9,'4_部屋一覧'!$K$4:$K$79),\"\")","v":""},null,0,false]
[null,{"$f":"IF(A10<>\"\",IF(VLOOKUP(A10,'2_施設一覧'!$A$4:$D$73,3,FALSE)=0,\"\",VLOOKUP(A10,'2_施設一覧'!$A$4:$D$73,3,FALSE)),\"\")","v":""},null,null,{"$f":"IF(SUMIF('4_部屋一覧'!$C$4:$C$79,C10,'4_部屋一覧'!$K$4:$K$79)<>0,SUMIF('4_部屋一覧'!$C$4:$C$79,C10,'4_部屋一覧'!$K$4:$K$79),\"\")","v":""},null,0,false]
{"$rows_left_out":107}
{"sheet":"4_部屋一覧","index":3,"n_rows":79,"n_cols":16,"rows_kept":79,"cut":false,"hidden":false,"merged":[]}
["（様式４）部屋一覧"]
[]
["施設№","施設名","平面図№","階など","部屋№","部屋名","部屋区分","床面積（㎡）","上限額","所要額","申請額"]
[null,{"$f":"IF(A4<>\"\",IF(IFERROR(VLOOKUP(A4,'2_施設一覧'!$A$4:$D$73,3,FALSE),\"\")=0,\"\",IFERROR(VLOOKUP(A4,'2_施設一覧'!$A$4:$D$73,3,FALSE),\"\")),\"\")","v":""},null,{"$f":"IF(C4<>\"\",IFERROR(VLOOKUP(C4,'3_平面図一覧'!$C$4:$D$116,2,FALSE),\"\"),\"\")","v":""},null,null,null,null,{"$f":"IFERROR(VLOOKUP(G4,リスト!$A$27:$B$30,2,FALSE),\"\")","v":""},{"$f":"IF(SUMIF('5_機器一覧'!$M$4:$M$75,M4,'5_機器一覧'!$J$4:$J$75)<>0,SUMIF('5_機器一覧'!$M$4:$M$75,M4,'5_機器一覧'!$J$4:$J$75),\"\")","v":""},{"$f":"IF(ROUNDDOWN(MIN(IF(I4<>\"\",I4,0),IF(J4<>\"\",J4,0)),-3)<>0,ROUNDDOWN(MIN(IF(I4<>\"\",I4,0),IF(J4<>\"\",J4,0)),-3),\"\")","v":""},null,{"$f":"C4&\"-\"&E4","v":"-"},{"$f":"F4","v":0},{"$f":"G4","v":0},{"$f":"OR(A4<>\"\",B4<>\"\",C4<>\"\",D4<>\"\",E4<>\"\",F4<>\"\",G4<>\"\",I4<>\"\",J4<>\"\",K4<>\"\")","v":false}]
[null,{"$f":"IF(A5<>\"\",IF(IFERROR(VLOOKUP(A5,'2_施設一覧'!$A$4:$D$73,3,FALSE),\"\")=0,\"\",IFERROR(VLOOKUP(A5,'2_施設一覧'!$A$4:$D$73,3,FALSE),\"\")),\"\")","v":""},null,{"$f":"IF(C5<>\"\",IFERROR(VLOOKUP(C5,'3_平面図一覧'!$C$4:$D$116,2,FALSE),\"\"),\"\")","v":""},null,null,null,null,{"$f":"IFERROR(VLOOKUP(G5,リスト!$A$27:$B$30,2,FALSE),\"\")","v":""},{"$f":"IF(SUMIF('5_機器一覧'!$M$4:$M$75,M5,'5_機器一覧'!$J$4:$J$75)<>0,SUMIF('5_機器一覧'!$M$4:$M$75,M5,'5_機器一覧'!$J$4:$J$75),\"\")","v":""},{"$f":"IF(ROUNDDOWN(MIN(IF(I5<>\"\",I5,0),IF(J5<>\"\",J5,0)),-3)<>0,ROUNDDOWN(MIN(IF(I5<>\"\",I5,0),IF(J5<>\"\",J5,0)),-3),\"\")","v":""},null,{"$f":"C5&\"-\"&E5","v":"-"},{"$f":"F5","v":0},{"$f":"G5","v":0},{"$f":"OR(A5<>\"\",B5<>\"\",C5<>\"\",D5<>\"\",E5<>\"\",F5<>\"\",G5<>\"\",I5<>\"\",J5<>\"\",K5<>\"\")","v":false}]
[null,{"$f":"IF(A6<>\"\",IF(IFERROR(VLOOKUP(A6,'2_施設一覧'!$A$4:$D$73,3,FALSE),\"\")=0,\"\",IFERROR(VLOOKUP(A6,'2_施設一覧'!$A$4:$D$73,3,FALSE),\"\")),\"\")","v":""},null,{"$f":"IF(C6<>\"\",IFERROR(VLOOKUP(C6,'3_平面図一覧'!$C$4:$D$116,2,FALSE),\"\"),\"\")","v":""},null,null,null,null,{"$f":"IFERROR(VLOOKUP(G6,リスト!$A$27:$B$30,2,FALSE),\"\")","v":""},{"$f":"IF(SUMIF('5_機器一覧'!$M$4:$M$75,M6,'5_機器一覧'!$J$4:$J$75)<>0,SUMIF('5_機器一覧'!$M$4:$M$75,M6,'5_機器一覧'!$J$4:$J$75),\"\")","v":""},"",null,"-",0,0,false]
[null,{"$f":"IF(A7<>\"\",IF(IFERROR(VLOOKUP(A7,'2_施設一覧'!$A$4:$D$73,3,FALSE),\"\")=0,\"\",IFERROR(VLOOKUP(A7,'2_施設一覧'!$A$4:$D$73,3,FALSE),\"\")),\"\")","v":""},null,{"$f":"IF(C7<>\"\",IFERROR(VLOOKUP(C7,'3_平面図一覧'!$C$4:$D$116,2,FALSE),\"\"),\"\")","v":""},null,null,null,null,{"$f":"IFERROR(VLOOKUP(G7,リスト!$A$27:$B$30,2,FALSE),\"\")","v":""},{"$f":"IF(SUMIF('5_機器一覧'!$M$4:$M$75,M7,'5_機器一覧'!$J$4:$J$75)<>0,SUMIF('5_機器一覧'!$M$4:$M$75,M7,'5_機器一覧'!$J$4:$J$75),\"\")","v":""},"",null,"-",0,0,false]
[null,{"$f":"IF(A8<>\"\",IF(IFERROR(VLOOKUP(A8,'2_施設一覧'!$A$4:$D$73,3,FALSE),\"\")=0,\"\",IFERROR(VLOOKUP(A8,'2_施設一覧'!$A$4:$D$73,3,FALSE),\"\")),\"\")","v":""},null,{"$f":"IF(C8<>\"\",IFERROR(VLOOKUP(C8,'3_平面図一覧'!$C$4:$D$116,2,FALSE),\"\"),\"\")","v":""},null,null,null,null,{"$f":"IFERROR(VLOOKUP(G8,リスト!$A$27:$B$30,2,FALSE),\"\")","v":""},{"$f":"IF(SUMIF('5_機器一覧'!$M$4:$M$75,M8,'5_機器一覧'!$J$4:$J$75)<>0,SUMIF('5_機器一覧'!$M$4:$M$75,M8,'5_機器一覧'!$J$4:$J$75),\"\")","v":""},"",null,"-",0,0,false]
[null,{"$f":"IF(A9<>\"\",IF(IFERROR(VLOOKUP(A9,'2_施設一覧'!$A$4:$D$73,3,FALSE),\"\")=0,\"\",IFERROR(VLOOKUP(A9,'2_施設一覧'!$A$4:$D$73,3,FALSE),\"\")),\"\")","v":""},null,{"$f":"IF(C9<>\"\",IFERROR(VLOOKUP(C9,'3_平面図一覧'!$C$4:$D$116,2,FALSE),\"\"),\"\")","v":""},null,null,null,null,{"$f":"IFERROR(VLOOKUP(G9,リスト!$A$27:$B$30,2,FALSE),\"\")","v":""},{"$f":"IF(SUMIF('5_機器一覧'!$M$4:$M$75,M9,'5_機器一覧'!$J$4:$J$75)<>0,SUMIF('5_機器一覧'!$M$4:$M$75,M9,'5_機器一覧'!$J$4:$J$75),\"\")","v":""},"",null,"-",0,0,false]
[null,{"$f":"IF(A10<>\"\",IF(IFERROR(VLOOKUP(A10,'2_施設一覧'!$A$4:$D$73,3,FALSE),\"\")=0,\"\",IFERROR(VLOOKUP(A10,'2_施設一覧'!$A$4:$D$73,3,FALSE),\"\")),\"\")","v":""},null,{"$f":"IF(C10<>\"\",IFERROR(VLOOKUP(C10,'3_平面図一覧'!$C$4:$D$116,2,FALSE),\"\"),\"\")","v":""},null,null,null,null,{"$f":"IFERROR(VLOOKUP(G10,リスト!$A$27:$B$30,2,FALSE),\"\")","v":""},{"$f":"IF(SUMIF('5_機器一覧'!$M$4:$M$75,M10,'5_機器一覧'!$J$4:$J$75)<>0,SUMIF('5_機器一覧'!$M$4:$M$75,M10,'5_機器一覧'!$J$4:$J$75),\"\")","v":""},"",null,"-",0,0,false]
{"$rows_left_out":70}
{"sheet":"5_機器一覧","index":4,"n_rows":75,"n_cols":15,"rows_kept":75,"cut":false,"hidden":false,"merged":[]}
["（様式５）機器一覧"]
[]
["施設№","施設名","平面図№","階など","部屋№","部屋名","部屋区分","機器№","機器区分","所要額","領収証№"]
[{"$f":"IF(C4<>\"\",IFERROR(VLOOKUP(C4,'3_平面図一覧'!$C$4:$G$116,5,FALSE),\"\"),\"\")","v":""},{"$f":"IF(A4<>\"\",IFERROR(VLOOKUP(A4,'2_施設一覧'!$A$4:$D$73,3,FALSE),\"\"),\"\")","v":""},null,{"$f":"IF(C4<>\"\",IFERROR(VLOOKUP(C4,'3_平面図一覧'!$C$4:$D$116,2,FALSE),\"\"),\"\")","v":""},null,{"$f":"IF(M4<>\"-\",IFERROR(VLOOKUP(M4,'4_部屋一覧'!$M$4:$O$79,2,FALSE),\"\"),\"\")","v":""},{"$f":"IF(M4<>\"-\",IFERROR(VLOOKUP(M4,'4_部屋一覧'!$M$4:$O$79,3,FALSE),\"\"),\"\")","v":""},null,null,null,null,null,{"$f":"C4&\"-\"&E4","v":"-"},null,{"$f":"OR(A4<>\"\",B4<>\"\",C4<>\"\",D4<>\"\",E4<>\"\",F4<>\"\",G4<>\"\",H4<>\"\",I4<>\"\",J4<>\"\",K4<>\"\")","v":false}]
[{"$f":"IF(C5<>\"\",IFERROR(VLOOKUP(C5,'3_平面図一覧'!$C$4:$G$116,5,FALSE),\"\"),\"\")","v":""},{"$f":"IF(A5<>\"\",IFERROR(VLOOKUP(A5,'2_施設一覧'!$A$4:$D$73,3,FALSE),\"\"),\"\")","v":""},null,{"$f":"IF(C5<>\"\",IFERROR(VLOOKUP(C5,'3_平面図一覧'!$C$4:$D$116,2,FALSE),\"\"),\"\")","v":""},null,{"$f":"IF(M5<>\"-\",IFERROR(VLOOKUP(M5,'4_部屋一覧'!$M$4:$O$79,2,FALSE),\"\"),\"\")","v":""},{"$f":"IF(M5<>\"-\",IFERROR(VLOOKUP(M5,'4_部屋一覧'!$M$4:$O$79,3,FALSE),\"\"),\"\")","v":""},null,null,null,null,null,{"$f":"C5&\"-\"&E5","v":"-"},null,{"$f":"OR(A5<>\"\",B5<>\"\",C5<>\"\",D5<>\"\",E5<>\"\",F5<>\"\",G5<>\"\",H5<>\"\",I5<>\"\",J5<>\"\",K5<>\"\")","v":false}]
[{"$f":"IF(C6<>\"\",IFERROR(VLOOKUP(C6,'3_平面図一覧'!$C$4:$G$116,5,FALSE),\"\"),\"\")","v":""},{"$f":"IF(A6<>\"\",IFERROR(VLOOKUP(A6,'2_施設一覧'!$A$4:$D$73,3,FALSE),\"\"),\"\")","v":""},null,{"$f":"IF(C6<>\"\",IFERROR(VLOOKUP(C6,'3_平面図一覧'!$C$4:$D$116,2,FALSE),\"\"),\"\")","v":""},null,{"$f":"IF(M6<>\"-\",IFERROR(VLOOKUP(M6,'4_部屋一覧'!$M$4:$O$79,2,FALSE),\"\"),\"\")","v":""},{"$f":"IF(M6<>\"-\",IFERROR(VLOOKUP(M6,'4_部屋一覧'!$M$4:$O$79,3,FALSE),\"\"),\"\")","v":""},null,null,null,null,null,{"$f":"C6&\"-\"&E6","v":"-"},null,false]
[{"$f":"IF(C7<>\"\",IFERROR(VLOOKUP(C7,'3_平面図一覧'!$C$4:$G$116,5,FALSE),\"\"),\"\")","v":""},{"$f":"IF(A7<>\"\",IFERROR(VLOOKUP(A7,'2_施設一覧'!$A$4:$D$73,3,FALSE),\"\"),\"\")","v":""},null,{"$f":"IF(C7<>\"\",IFERROR(VLOOKUP(C7,'3_平面図一覧'!$C$4:$D$116,2,FALSE),\"\"),\"\")","v":""},null,{"$f":"IF(M7<>\"-\",IFERROR(VLOOKUP(M7,'4_部屋一覧'!$M$4:$O$79,2,FALSE),\"\"),\"\")","v":""},{"$f":"IF(M7<>\"-\",IFERROR(VLOOKUP(M7,'4_部屋一覧'!$M$4:$O$79,3,FALSE),\"\"),\"\")","v":""},null,null,null,null,null,"-",null,false]
[{"$f":"IF(C8<>\"\",IFERROR(VLOOKUP(C8,'3_平面図一覧'!$C$4:$G$116,5,FALSE),\"\"),\"\")","v":""},{"$f":"IF(A8<>\"\",IFERROR(VLOOKUP(A8,'2_施設一覧'!$A$4:$D$73,3,FALSE),\"\"),\"\")","v":""},null,{"$f":"IF(C8<>\"\",IFERROR(VLOOKUP(C8,'3_平面図一覧'!$C$4:$D$116,2,FALSE),\"\"),\"\")","v":""},null,{"$f":"IF(M8<>\"-\",IFERROR(VLOOKUP(M8,'4_部屋一覧'!$M$4:$O$79,2,FALSE),\"\"),\"\")","v":""},{"$f":"IF(M8<>\"-\",IFERROR(VLOOKUP(M8,'4_部屋一覧'!$M$4:$O$79,3,FALSE),\"\"),\"\")","v":""},null,null,null,null,null,"-",null,false]
[{"$f":"IF(C9<>\"\",IFERROR(VLOOKUP(C9,'3_平面図一覧'!$C$4:$G$116,5,FALSE),\"\"),\"\")","v":""},{"$f":"IF(A9<>\"\",IFERROR(VLOOKUP(A9,'2_施設一覧'!$A$4:$D$73,3,FALSE),\"\"),\"\")","v":""},null,{"$f":"IF(C9<>\"\",IFERROR(VLOOKUP(C9,'3_平面図一覧'!$C$4:$D$116,2,FALSE),\"\"),\"\")","v":""},null,{"$f":"IF(M9<>\"-\",IFERROR(VLOOKUP(M9,'4_部屋一覧'!$M$4:$O$79,2,FALSE),\"\"),\"\")","v":""},{"$f":"IF(M9<>\"-\",IFERROR(VLOOKUP(M9,'4_部屋一覧'!$M$4:$O$79,3,FALSE),\"\"),\"\")","v":""},null,null,null,null,null,"-",null,false]
[{"$f":"IF(C10<>\"\",IFERROR(VLOOKUP(C10,'3_平面図一覧'!$C$4:$G$116,5,FALSE),\"\"),\"\")","v":""},{"$f":"IF(A10<>\"\",IFERROR(VLOOKUP(A10,'2_施設一覧'!$A$4:$D$73,3,FALSE),\"\"),\"\")","v":""},null,{"$f":"IF(C10<>\"\",IFERROR(VLOOKUP(C10,'3_平面図一覧'!$C$4:$D$116,2,FALSE),\"\"),\"\")","v":""},null,{"$f":"IF(M10<>\"-\",IFERROR(VLOOKUP(M10,'4_部屋一覧'!$M$4:$O$79,2,FALSE),\"\"),\"\")","v":""},{"$f":"IF(M10<>\"-\",IFERROR(VLOOKUP(M10,'4_部屋一覧'!$M$4:$O$79,3,FALSE),\"\"),\"\")","v":""},null,null,null,null,null,"-",null,false]
{"$rows_left_out":66}
{"sheet":"6_領収証等一覧","index":5,"n_rows":119,"n_cols":8,"rows_kept":119,"cut":false,"hidden":false,"merged":[]}
["（様式６）領収証等一覧"]
[]
["領収証№","領収証金額","所要額合計","納品日","納品書有無"]
[null,null,{"$f":"IF(SUMIF('5_機器一覧'!$K$4:$K$75,'6_領収証等一覧'!A4,'5_機器一覧'!$J$4:$J$75)<>0,SUMIF('5_機器一覧'!$K$4:$K$75,'6_領収証等一覧'!A4,'5_機器一覧'!$J$4:$J$75),\"\")","v":""},null,null,null,null,{"$f":"OR(A4<>\"\",B4<>\"\",C4<>\"\",D4<>\"\",E4<>\"\")","v":false}]
[null,null,{"$f":"IF(SUMIF('5_機器一覧'!$K$4:$K$75,'6_領収証等一覧'!A5,'5_機器一覧'!$J$4:$J$75)<>0,SUMIF('5_機器一覧'!$K$4:$K$75,'6_領収証等一覧'!A5,'5_機器一覧'!$J$4:$J$75),\"\")","v":""},null,null,null,null,{"$f":"OR(A5<>\"\",B5<>\"\",C5<>\"\",D5<>\"\",E5<>\"\")","v":false}]
[null,null,{"$f":"IF(SUMIF('5_機器一覧'!$K$4:$K$75,'6_領収証等一覧'!A6,'5_機器一覧'!$J$4:$J$75)<>0,SUMIF('5_機器一覧'!$K$4:$K$75,'6_領収証等一覧'!A6,'5_機器一覧'!$J$4:$J$75),\"\")","v":""},null,null,null,null,false]
[null,null,{"$f":"IF(SUMIF('5_機器一覧'!$K$4:$K$75,'6_領収証等一覧'!A7,'5_機器一覧'!$J$4:$J$75)<>0,SUMIF('5_機器一覧'!$K$4:$K$75,'6_領収証等一覧'!A7,'5_機器一覧'!$J$4:$J$75),\"\")","v":""},null,null,null,null,false]
[null,null,{"$f":"IF(SUMIF('5_機器一覧'!$K$4:$K$75,'6_領収証等一覧'!A8,'5_機器一覧'!$J$4:$J$75)<>0,SUMIF('5_機器一覧'!$K$4:$K$75,'6_領収証等一覧'!A8,'5_機器一覧'!$J$4:$J$75),\"\")","v":""},null,null,null,null,false]
[null,null,{"$f":"IF(SUMIF('5_機器一覧'!$K$4:$K$75,'6_領収証等一覧'!A9,'5_機器一覧'!$J$4:$J$75)<>0,SUMIF('5_機器一覧'!$K$4:$K$75,'6_領収証等一覧'!A9,'5_機器一覧'!$J$4:$J$75),\"\")","v":""},null,null,null,null,false]
[null,null,{"$f":"IF(SUMIF('5_機器一覧'!$K$4:$K$75,'6_領収証等一覧'!A10,'5_機器一覧'!$J$4:$J$75)<>0,SUMIF('5_機器一覧'!$K$4:$K$75,'6_領収証等一覧'!A10,'5_機器一覧'!$J$4:$J$75),\"\")","v":""},null,null,null,null,false]
{"$rows_left_out":110}
{"sheet":"7_台紙","index":6,"n_rows":62,"n_cols":32,"rows_kept":62,"cut":false,"hidden":false,"merged":[[58,0,58,1],[58,2,58,6],[58,7,58,9],[58,10,58,12],[58,13,58,15],[56,27,56,30],[58,16,58,19],[58,20,58,24],[58,25,58,26],[58,27,58,30],[56,2,56,6],[56,7,56,9],[56,10,56,12],[56,13,56,15],[56,16,56,19],[56,20,56,24],[56,25,56,26],[54,31,54,34],[58,31,58,34],[57,16,57,19],[57,20,57,24],[57,25,57,26],[57,27,57,30],[57,31,57,34],[55,0,55,1],[55,2,55,6],[55,7,55,9],[55,10,55,12],[55,13,55,15],[56,31,56,34],[57,0,57,1],[57,2,57,6],[57,7,57,9],[57,10,57,12],[57,13,57,15],[55,16,55,19],[55,20,55,24],[55,25,55,26],[55,27,55,30],[55,31,55,34],[56,0,56,1],[54,0,54,1],[54,2,54,6],[54,7,54,9],[54,10,54,12],[54,13,54,15],[54,16,54,19],[54,20,54,24],[54,25,54,26],[54,27,54,30],[52,31,52,34],[53,0,53,1],[53,2,53,6],[53,7,53,9],[53,10,53,12],[53,13,53,15],[53,16,53,19],[53,20,53,24],[53,25,53,26],[53,27,53,30],[53,31,53,34],[52,0,52,1],[52,2,52,6],[52,7,52,9],[52,10,52,12],[52,13,52,15],[52,16,52,19],[52,20,52,24],[52,25,52,26],[52,27,52,30],[50,31,50,34],[51,0,51,1],[51,2,51,6],[51,7,51,9],[51,10,51,12],[51,13,51,15],[51,16,51,19],[51,20,51,24],[51,25,51,26],[51,27,51,30],[51,31,51,34],[50,0,50,1],[50,2,50,6],[50,7,50,9],[50,10,50,12],[50,13,50,15],[50,16,50,19],[50,20,50,24],[50,25,50,26],[50,27,50,30],[48,31,48,34],[49,0,49,1],[49,2,49,6],[49,7,49,9],[49,10,49,12],[49,13,49,15],[49,16,49,19],[49,20,49,24],[49,25,49,26],[49,27,49,30],[49,31,49,34],[48,0,48,1],[48,2,48,6],[48,7,48,9],[48,10,48,12],[48,13,48,15],[48,16,48,19],[48,20,48,24],[48,25,48,26],[48,27,48,30],[46,31,46,34],[47,0,47,1],[47,2,47,6],[47,7,47,9],[47,10,47,12],[47,13,47,15],[47,16,47,19],[47,20,47,24],[47,25,47,26],[47,27,47,30],[47,31,47,34],[46,0,46,1],[46,2,46,6],[46,7,46,9],[46,10,46,12],[46,13,46,15],[46,16,46,19],[46,20,46,24],[46,25,46,26],[46,27,46,30],[44,31,44,34],[45,0,45,1],[45,2,45,6],[45,7,45,9],[45,10,45,12],[45,13,45,15],[45,16,45,19],[45,20,45,24],[45,25,45,26],[45,27,45,30],[45,31,45,34],[44,0,44,1],[44,2,44,6],[44,7,44,9],[44,10,44,12],[44,13,44,15],[44,16,44,19],[44,20,44,24],[44,25,44,26],[44,27,44,30],[42,31,42,34],[43,0,43,1],[43,2,43,6],[43,7,43,9],[43,10,43,12],[43,13,43,15],[43,16,43,19],[43,20,43,24],[43,25,43,26],[43,27,43,30],[43,31,43,34],[42,0,42,1],[42,2,42,6],[42,7,42,9],[42,10,42,12],[42,13,42,15],[42,16,42,19],[42,20,42,24],[42,25,42,26],[42,27,42,30],[40,31,40,34],[41,0,41,1],[41,2,41,6],[41,7,41,9],[41,10,41,12],[41,13,41,15],[41,16,41,19],[41,20,41,24],[41,25,41,26],[41,27,41,30],[41,31,41,34],[40,0,40,1],[40,2,40,6],[40,7,40,9],[40,10,40,12],[40,13,40,15],[40,16,40,19],[40,20,40,24],[40,25,40,26],[40,27,40,30],[38,31,38,34],[39,0,39,1],[39,2,39,6],[39,7,39,9],[39,10,39,12],[39,13,39,15],[39,16,39,19],[39,20,39,24],[39,25,39,26],[39,27,39,30],[39,31,39,34],[38,0,38,1],[38,2,38,6],[38,7,38,9],[38,10,38,12],[38,13,38,15],[38,16,38,19],[38,20,38,24],[38,25,38,26],[38,27,38,30],[36,31,36,34],[37,0,37,1],[37,2,37,6],[37,7,37,9],[37,10,37,12],[37,13,37,15],[37,16,37,19],[37,20,37,24],[37,25,37,26],[37,27,37,30],[37,31,37,34],[36,0,36,1],[36,2,36,6],[36,7,36,9],[36,10,36,12],[36,13,36,15],[36,16,36,19],[36,20,36,24],[36,25,36,26],[36,27,36,30],[34,31,34,34],[35,0,35,1],[35,2,35,6],[35,7,35,9],[35,10,35,12],[35,13,35,15],[35,16,35,19],[35,20,35,24],[35,25,35,26],[35,27,35,30],[35,31,35,34],[34,0,34,1],[34,2,34,6],[34,7,34,9],[34,10,34,12],[34,13,34,15],[34,16,34,19],[34,20,34,24],[34,25,34,26],[34,27,34,30],[32,31,32,34],[33,0,33,1],[33,2,33,6],[33,7,33,9],[33,10,33,12],[33,13,33,15],[33,16,33,19],[33,20,33,24],[33,25,33,26],[33,27,33,30],[33,31,33,34],[32,0,32,1],[32,2,32,6],[32,7,32,9],[32,10,32,12],[32,13,32,15],[32,16,32,19],[32,20,32,24],[32,25,32,26],[32,27,32,30],[30,31,30,34],[31,0,31,1],[31,2,31,6],[31,7,31,9],[31,10,31,12],[31,13,31,15],[31,16,31,19],[31,20,31,24],[31,25,31,26],[31,27,31,30],[31,31,31,34],[30,0,30,1],[30,2,30,6],[30,7,30,9],[30,10,30,12],[30,13,30,15],[30,16,30,19],[30,20,30,24],[30,25,30,26],[30,27,30,30],[28,31,28,34],[29,0,29,1],[29,2,29,6],[29,7,29,9],[29,10,29,12],[29,13,29,15],[29,16,29,19],[29,20,29,24],[29,25,29,26],[29,27,29,30],[29,31,29,34],[28,0,28,1],[28,2,28,6],[28,7,28,9],[28,10,28,12],[28,13,28,15],[28,16,28,19],[28,20,28,24],[28,25,28,26],[28,27,28,30],[26,31,26,34],[27,0,27,1],[27,2,27,6],[27,7,27,9],[27,10,27,12],[27,13,27,15],[27,16,27,19],[27,20,27,24],[27,25,27,26],[27,27,27,30],[27,31,27,34],[26,0,26,1],[26,2,26,6],[26,7,26,9],[26,10,26,12],[26,13,26,15],[26,16,26,19],[26,20,26,24],[26,25,26,26],[26,27,26,30],[24,31,24,34],[25,0,25,1],[25,2,25,6],[25,7,25,9],[25,10,25,12],[25,13,25,15],[25,16,25,19],[25,20,25,24],[25,25,25,26],[25,27,25,30],[25,31,25,34],[24,0,24,1],[24,2,24,6],[24,7,24,9],[24,10,24,12],[24,13,24,15],[24,16,24,19],[24,20,24,24],[24,25,24,26],[24,27,24,30],[22,31,22,34],[23,0,23,1],[23,2,23,6],[23,7,23,9],[23,10,23,12],[23,13,23,15],[23,16,23,19],[23,20,23,24],[23,25,23,26],[23,27,23,30],[23,31,23,34],[22,0,22,1],[22,2,22,6],[22,7,22,9],[22,10,22,12],[22,13,22,15],[22,16,22,19],[22,20,22,24],[22,25,22,26],[22,27,22,30],[20,31,20,34],[21,0,21,1],[21,2,21,6],[21,7,21,9],[21,10,21,12],[21,13,21,15],[21,16,21,19],[21,20,21,24],[21,25,21,26],[21,27,21,30],[21,31,21,34],[20,0,20,1],[20,2,20,6],[20,7,20,9],[20,10,20,12],[20,13,20,15],[20,16,20,19],[20,20,20,24],[20,25,20,26],[20,27,20,30],[18,31,18,34],[19,0,19,1],[19,2,19,6],[19,7,19,9],[19,10,19,12],[19,13,19,15],[19,16,19,19],[19,20,19,24],[19,25,19,26],[19,27,19,30],[19,31,19,34],[18,0,18,1],[18,2,18,6],[18,7,18,9],[18,10,18,12],[18,13,18,15],[18,16,18,19],[18,20,18,24],[18,25,18,26],[18,27,18,30],[16,31,16,34],[17,0,17,1],[17,2,17,6],[17,7,17,9],[17,10,17,12],[17,13,17,15],[17,16,17,19],[17,20,17,24],[17,25,17,26],[17,27,17,30],[17,31,17,34],[16,0,16,1],[16,2,16,6],[16,7,16,9],[16,10,16,12],[16,13,16,15],[16,16,16,19],[16,20,16,24],[16,25,16,26],[16,27,16,30],[14,31,14,34],[15,0,15,1],[15,2,15,6],[15,7,15,9],[15,10,15,12],[15,13,15,15],[15,16,15,19],[15,20,15,24],[15,25,15,26],[15,27,15,30],[15,31,15,34],[14,0,14,1],[14,2,14,6],[14,7,14,9],[14,10,14,12],[14,13,14,15],[14,16,14,19],[14,20,14,24],[14,25,14,26],[14,27,14,30],[12,31,12,34],[13,0,13,1],[13,2,13,6],[13,7,13,9],[13,10,13,12],[13,13,13,15],[13,16,13,19],[13,20,13,24],[13,25,13,26],[13,27,13,30],[13,31,13,34],[12,0,12,1],[12,2,12,6],[12,7,12,9],[12,10,12,12],[12,13,12,15],[12,16,12,19],[12,20,12,24],[12,25,12,26],[12,27,12,30],[10,31,10,34],[11,0,11,1],[11,2,11,6],[11,7,11,9],[11,10,11,12],[11,13,11,15],[11,16,11,19],[11,20,11,24],[11,25,11,26],[11,27,11,30],[11,31,11,34],[10,0,10,1],[10,2,10,6],[10,7,10,9],[10,10,10,12],[10,13,10,15],[10,16,10,19],[10,20,10,24],[10,25,10,26],[10,27,10,30],[8,31,8,34],[9,0,9,1],[9,2,9,6],[9,7,9,9],[9,10,9,12],[9,13,9,15],[9,16,9,19],[9,20,9,24],[9,25,9,26],[9,27,9,30],[9,31,9,34],[8,0,8,1],[8,2,8,6],[8,7,8,9],[8,10,8,12],[8,13,8,15],[8,16,8,19],[8,20,8,24],[8,25,8,26],[8,27,8,30],[6,31,6,34],[7,0,7,1],[7,2,7,6],[7,7,7,9],[7,10,7,12],[7,13,7,15],[7,16,7,19],[7,20,7,24],[7,25,7,26],[7,27,7,30],[7,31,7,34],[6,0,6,1],[6,2,6,6],[6,7,6,9],[6,10,6,12],[6,13,6,15],[6,16,6,19],[6,20,6,24],[6,25,6,26],[6,27,6,30],[3,0,3,3],[3,17,3,20],[3,21,3,34],[4,0,4,34],[5,0,5,1],[5,2,5,6],[5,7,5,9],[5,10,5,12],[5,13,5,15],[5,16,5,19],[5,20,5,24],[5,25,5,26],[5,27,5,30],[5,31,5,34],[3,4,3,10],[3,11,3,13],[3,14,3,16],[1,0,1,3],[1,4,1,16],[1,17,1,20],[1,21,1,34],[2,0,2,3],[2,4,2,16],[2,17,2,20],[2,21,2,34],[0,0,0,34]]}
["（様式７）領収証等貼付台紙"]
["ファイル名",null,null,null,null,null,null,null,null,null,null,null,null,null,null,null,null,"法人名"]
["領収書№",null,null,null,null,null,null,null,null,null,null,null,null,null,null,null,null,"領収書金額"]
["納品日",null,null,null,null,null,null,null,null,null,null,"納品書有無",null,null,null,null,null,"所要額合計"]
[1]
["施設№",null,"施設名",null,null,null,null,"平面図№",null,null,"階など",null,null,"部屋№",null,null,"部屋名",null,null,null,"部屋区分",null,null,null,null,"機器№",null,"機器区分",null,null,null,"所要額"]
[null,null,null,null,null,null,null,""]
[null,null,null,null,null,null,null,""]
[]
[]
{"$rows_left_out":53}
{"sheet":"リスト","index":7,"n_rows":38,"n_cols":7,"rows_kept":38,"cut":false,"hidden":true,"merged":[]}
[]
["施設分類","保護施設","高齢者施設","障害者施設","保育所・幼稚園等","児童養護施設等","放課後子供教室"]
["所管課","福祉保健総務課","健康長寿推進課","障害福祉課","子育て政策課","子ども福祉課","生涯学習課"]
["所定の番号","なし","介護保険事業所番号","事業所番号","なし","なし","なし"]
["申請先","山梨県知事","山梨県知事","山梨県知事","山梨県知事","山梨県知事","山梨県教育長"]
["施設種別数",{"$f":"COUNTA(B7:B24)","v":1},{"$f":"COUNTA(C7:C24)","v":18},12,7,4,1]
["施設種別","救護施設","介護老人福祉施設","施設入所支援","認可保育所","児童養護施設","放課後子供教室（小学校の教室等を使用している場合を除く。）"]
[null,null,"介護老人保健施設","療養介護事業所","幼稚園","乳児院"]
[null,null,"介護療養型医療施設","短期入所事業所","認定こども園","自立援助ホーム"]
[null,null,"介護医療院","共同生活援助事業所（グループホーム）","地域型保育施設","ファミリーホーム"]
{"$rows_left_out":28}